Page MenuHomePhabricator Dev

Buildable 4104
PassedPublic

Properties

Container
D2967: no bug - Doc: document `vscode` integration. r=sylvestre
Buildable
Diff 4628
Origin
Automatic Buildable

Unit TestsFailed

TimeTest
32,902 mscode-review::mercurial
WARNING: The code review bot failed to apply your patch.
file docs/contributing/vscode.rst already exists
1 out of 1 hunks FAILED -- saving rejects to file docs/contributing/vscode.rst.rej
file docs/contributing/img/type_hierarchy.gif already exists
1 out of 1 hunks FAILED -- saving rejects to file docs/contributing/img/type_hierarchy.gif.rej
file docs/contributing/img/rename_symbol.gif already exists
1 out of 1 hunks FAILED -- saving rejects to file docs/contributing/img/rename_symbol.gif.rej
file docs/contributing/img/goto_definition.gif already exists
1 out of 1 hunks FAILED -- saving rejects to file docs/contributing/img/goto_definition.gif.rej
file docs/contributing/img/format_selection.gif already exists
1 out of 1 hunks FAILED -- saving rejects to file docs/contributing/img/format_selection.gif.rej
file docs/contributing/img/find_references.gif already exists
1 out of 1 hunks FAILED -- saving rejects to file docs/contributing/img/find_references.gif.rej
file docs/contributing/img/diagnostic_error.gif already exists
1 out of 1 hunks FAILED -- saving rejects to file docs/contributing/img/diagnostic_error.gif.rej
file docs/contributing/img/auto_completion.gif already exists
1 out of 1 hunks FAILED -- saving rejects to file docs/contributing/img/auto_completion.gif.rej
patching file docs/contributing/editor.rst
Hunk #1 FAILED at 13
1 out of 1 hunks FAILED -- saving rejects to file docs/contributing/editor.rst.rej
abort: patch failed to apply

Builds

  • Build 7048 Build
    Target 5511Code Review creation
  • Build 7047 Analysis

Event Timeline