Page MenuHomePhabricator Dev

Buildable 4458
PassedPublic

Properties

Container
D3201: Testing tgdiff on phabricator dev
Buildable
Diff 5114
Origin
Automatic Buildable

Unit TestsFailed

TimeTest
9,162 mscode-review::mercurial
WARNING: The code review bot failed to apply your patch.
unable to find 'taskcluster/ci/source-test/taskgraph.yml' for patching
(use '--prefix' to apply patch relative to the current directory)
1 out of 1 hunks FAILED -- saving rejects to file taskcluster/ci/source-test/taskgraph.yml.rej
patching file taskcluster/ci/source-test/python.yml
Hunk #1 FAILED at 63
1 out of 1 hunks FAILED -- saving rejects to file taskcluster/ci/source-test/python.yml.rej
abort: patch failed to apply

Builds

  • Build 7507 Build
    Target 5648Code Review creation
  • Build 7506 Analysis

Event Timeline