Details
Details
- Reviewers
- None
- Bugzilla Bug ID
- Not provided
Diff Detail
Diff Detail
- Repository
- rMC m-c
| Time | Test | |
|---|---|---|
| 9,162 ms | code-review::mercurial WARNING: The code review bot failed to apply your patch.
unable to find 'taskcluster/ci/source-test/taskgraph.yml' for patching (use '--prefix' to apply patch relative to the current directory) 1 out of 1 hunks FAILED -- saving rejects to file taskcluster/ci/source-test/taskgraph.yml.rej patching file taskcluster/ci/source-test/python.yml Hunk #1 FAILED at 63 1 out of 1 hunks FAILED -- saving rejects to file taskcluster/ci/source-test/python.yml.rej abort: patch failed to apply |